{"text_format":"1","workbook":"xlsx","n_sheets":29,"sheets":["COVER AND TABLE","JURAT ","ASSETS","LIAB & CAPITAL","INCOME","CASH FLOW","SCH. A","SCH. B","SCH. C","SCH. F - Part 1","SCH. F - Part 2","SCH. P - Part 1","SCH. P - Part 2","COMM AUTO LIAB","COMM AUTO PD","COMM PROP","CONTRACTUAL LIAB","EMPLOYEE BENEFITS","GEN LIAB","MULTI-PERIL CROP","OTHER CAS","PRODUCTS LIAB","PROF LIAB","PROPERTY DAM LIAB","REIMBURSEMENT POLICY","ALL OTHER","SUMMARY DEVELOP","QUESTIONNAIRE","CROSSCHECK"],"not_rendered":{"charts":0,"images":2,"macros":1,"external_links":0,"defined_names":31,"comments":0,"pivot_tables":0},"unopened":[],"bounds":{"document_bytes":16777216,"sheet_cells":100000,"rows_first":2000,"rows_last":500,"rows_between":2000,"halvings":0,"cell_chars":16384,"cell_head_chars":4096},"cells_cut":0,"cells_raw":0,"read":"whole","date_system":"1900"}

{"sheet":"COVER AND TABLE","index":0,"n_rows":66,"n_cols":1,"rows_kept":66,"cut":false,"hidden":false,"merged":[[39,0,39,1],[54,0,54,1],[0,0,0,2],[1,0,1,2],[2,0,2,2],[53,0,53,1],[5,0,5,1],[6,0,6,1],[33,0,33,1],[34,0,34,1],[37,0,37,1],[49,0,49,1],[50,0,50,1],[51,0,51,1],[65,0,65,1],[66,0,66,1],[46,0,46,1],[47,0,47,1],[40,0,40,1],[42,0,42,1],[43,0,43,1],[58,0,58,1],[52,0,52,1],[64,0,64,1],[56,0,56,1],[57,0,57,1],[55,0,55,1]]}
[]
[]
[]
[]
[]
["Company Name"]
["TDI License Number"]
[]
{"$rows_left_out":59}
{"sheet":"JURAT ","index":1,"n_rows":52,"n_cols":14,"rows_kept":52,"cut":false,"hidden":false,"merged":[[9,8,9,13],[10,8,10,13],[1,0,1,14],[0,0,0,14],[2,0,2,14],[5,8,5,13],[7,8,7,13],[8,8,8,13],[6,8,6,13],[33,0,33,14],[32,13,32,14],[23,0,23,14],[12,0,12,14],[14,2,14,6],[19,2,19,6],[19,10,19,14],[14,10,14,14],[15,2,15,6],[16,2,16,6],[17,2,17,6],[17,10,17,14],[18,2,18,6],[15,10,15,14],[16,10,16,14],[18,10,18,14],[21,6,21,14],[25,1,25,4],[27,1,27,4],[28,1,28,4],[29,1,29,4],[26,1,26,4],[28,6,28,9],[29,6,29,9],[32,5,32,12],[25,11,25,14],[27,11,27,14],[28,11,28,14],[29,11,29,14],[25,6,25,9],[27,6,27,9],[26,6,26,9],[26,11,26,14],[35,1,35,4],[36,1,36,4],[37,1,37,4],[38,1,38,4],[35,11,35,14],[37,11,37,14],[38,11,38,14],[35,6,35,9],[45,8,45,9],[47,2,47,5],[40,1,40,4],[36,11,36,14],[37,6,37,9],[38,6,38,9],[39,6,39,9],[40,6,40,9],[36,6,36,9],[39,11,39,14],[40,11,40,14]]}
[{"$f":"'COVER AND TABLE'!A6","v":"Company Name"}]
["Jurat Page"]
[{"$f":"'COVER AND TABLE'!A35","v":"2023-12-31"}]
[]
[]
[null,"Incorporated (Date):"]
[null,"Type of Captive:"]
[null,"Commenced Business (Date):"]
{"$rows_left_out":45}
{"sheet":"ASSETS","index":2,"n_rows":31,"n_cols":8,"rows_kept":31,"cut":false,"hidden":false,"merged":[[13,0,13,2],[6,0,6,2],[2,0,2,8],[0,0,0,8],[1,0,1,8]]}
[{"$f":"'COVER AND TABLE'!A6","v":"Company Name"}]
["Assets"]
[{"$f":"'COVER AND TABLE'!A35:C35","v":"2023-12-31"}]
[]
[]
[null,null,null,null,null,{"$f":"'COVER AND TABLE'!A35","v":"2023-12-31"},null,{"$f":"DATE(YEAR(F6)-1,MONTH(F6),DAY(F6))","v":"2022-12-31"}]
[]
[]
{"$rows_left_out":24}
{"sheet":"LIAB & CAPITAL","index":3,"n_rows":38,"n_cols":8,"rows_kept":38,"cut":false,"hidden":false,"merged":[[0,0,0,8],[1,0,1,8],[2,0,2,8],[37,0,37,2],[7,0,7,3],[24,0,24,2],[26,0,26,2],[5,0,5,2],[35,0,35,2]]}
[{"$f":"'COVER AND TABLE'!A6","v":"Company Name"}]
["Liabilities, Capital and Surplus"]
[{"$f":"'COVER AND TABLE'!A35:C35","v":"2023-12-31"}]
[]
[]
[null,null,null,null,null,{"$f":"'COVER AND TABLE'!A35","v":"2023-12-31"},null,{"$f":"DATE(YEAR(F6)-1,MONTH(F6),DAY(F6))","v":"2022-12-31"}]
[]
["LIABILITIES"]
{"$rows_left_out":31}
{"sheet":"INCOME","index":4,"n_rows":49,"n_cols":9,"rows_kept":49,"cut":false,"hidden":false,"merged":[[0,0,0,8],[35,0,35,7],[6,0,6,3],[7,0,7,2],[1,0,1,8],[5,5,5,7],[2,0,2,8],[31,0,31,2],[32,0,32,2]]}
[{"$f":"'COVER AND TABLE'!A6","v":"Company Name"}]
["Income Statement"]
[{"$f":"'COVER AND TABLE'!A35:C35","v":"2023-12-31"}]
[]
[]
[null,null,null,null,null,"Fiscal Years Ended"]
[null,null,null,null,null,{"$f":"'COVER AND TABLE'!A35","v":"2023-12-31"},null,{"$f":"DATE(YEAR(F7)-1,MONTH(F7),DAY(F7))","v":"2022-12-31"}]
[]
{"$rows_left_out":42}
{"sheet":"CASH FLOW","index":5,"n_rows":53,"n_cols":8,"rows_kept":53,"cut":false,"hidden":false,"merged":[[44,0,46,0],[0,0,0,8],[1,0,1,8],[5,5,5,7],[2,0,2,8],[3,0,3,7],[6,0,6,3],[7,0,7,2],[33,0,33,2],[39,0,39,2]]}
[{"$f":"'COVER AND TABLE'!A6","v":"Company Name"}]
["Cash Flow"]
[{"$f":"'COVER AND TABLE'!A35:C35","v":"2023-12-31"}]
[]
[]
[null,null,null,null,null,"Fiscal Years Ended"]
[null,null,null,null,null,{"$f":"'COVER AND TABLE'!A35","v":"2023-12-31"},null,{"$f":"DATE(YEAR(F7)-1,MONTH(F7),DAY(F7))","v":"2022-12-31"}]
["CASH FLOWS PROVIDED BY OPERATIONS"]
{"$rows_left_out":46}
{"sheet":"SCH. A","index":6,"n_rows":40,"n_cols":9,"rows_kept":40,"cut":false,"hidden":false,"merged":[[31,1,31,3],[26,0,26,3],[17,0,17,1],[18,0,18,1],[20,0,20,3],[37,0,37,3],[19,0,19,1],[39,0,39,3],[0,0,0,9],[2,0,2,9],[6,0,6,4],[4,6,4,8],[1,0,1,9],[3,0,3,9],[11,0,11,1],[12,0,12,1],[36,1,36,3],[13,0,13,1],[14,0,14,1],[15,0,15,1],[16,0,16,1]]}
[{"$f":"'COVER AND TABLE'!A6","v":"Company Name"}]
["Schedule A"]
["Cash and Invested Assets"]
[{"$f":"'COVER AND TABLE'!A35:C35","v":"2023-12-31"}]
[]
[]
[null,null,null,null,null,null,{"$f":"'COVER AND TABLE'!A35","v":"2023-12-31"},null,{"$f":"DATE(YEAR(G7)-1,MONTH(G7),DAY(G7))","v":"2022-12-31"}]
[]
{"$rows_left_out":33}
{"sheet":"SCH. B","index":7,"n_rows":44,"n_cols":9,"rows_kept":44,"cut":false,"hidden":false,"merged":[[3,0,3,8],[0,0,0,8],[2,0,2,8],[1,0,1,8]]}
[{"$f":"'COVER AND TABLE'!A6","v":"Company Name"}]
["Schedule B"]
["Expenses Incurred"]
[{"$f":"'COVER AND TABLE'!A35:C35","v":"2023-12-31"}]
[]
[]
[null,null,"Loss",null,"Other"]
[null,null,"Adjustment",null,"Underwriting",null,"Investment"]
{"$rows_left_out":37}
{"sheet":"SCH. C","index":8,"n_rows":30,"n_cols":15,"rows_kept":30,"cut":false,"hidden":false,"merged":[[0,0,0,14],[1,0,1,14],[2,0,2,14],[3,0,3,14]]}
[{"$f":"'COVER AND TABLE'!A6","v":"Company Name"}]
["Schedule C"]
["Premiums"]
[{"$f":"'COVER AND TABLE'!A35:C35","v":"2023-12-31"}]
[]
[null,null,null,null,null,null,null,null,"Net",null,"Unearned",null,"Unearned",null,"Net"]
[null,null,"Direct",null,"Reinsurance",null,"Reinsurance",null,"Written",null,"Premiums",null,"Premiums",null,"Earned"]
["Line of Business",null,"Written",null,"Assumed",null,"Ceded",null,"Premium",null,"Prior Year End",null,{"$f":"'COVER AND TABLE'!A35","v":"2023-12-31"},null,"Premiums"]
{"$rows_left_out":23}
{"sheet":"SCH. F - Part 1","index":9,"n_rows":33,"n_cols":12,"rows_kept":33,"cut":false,"hidden":false,"merged":[[6,3,6,5],[0,0,0,11],[1,0,1,11],[2,0,2,11],[4,0,4,7],[3,0,3,11]]}
[{"$f":"'COVER AND TABLE'!A6","v":"Company Name"}]
["Schedule F - Part 1"]
["Reinsurance Assumed"]
[{"$f":"'COVER AND TABLE'!A35:C35","v":"2023-12-31"}]
[]
[]
[null,null,null,"Reinsurance On",null,null,"Assumed",null,null,"Letters","Assets","Assets"]
[null,null,"Assumed","Paid Losses","Case","IBNR","Premium","Unearned","Funds","of","Securing","Pledged"]
{"$rows_left_out":26}
{"sheet":"SCH. F - Part 2","index":10,"n_rows":29,"n_cols":12,"rows_kept":29,"cut":false,"hidden":false,"merged":[[5,3,5,7],[0,0,0,11],[1,0,1,11],[2,0,2,11],[4,0,4,6],[3,0,3,11]]}
[{"$f":"'COVER AND TABLE'!A6","v":"Company Name"}]
["Schedule F - Part 2"]
["Reinsurance Ceded"]
[{"$f":"'COVER AND TABLE'!A35:C35","v":"2023-12-31"}]
[]
[null,null,null,"Reinsurance Recoverable on"]
[null,null,"Reinsurance","Paid","Case","IBNR",null,null,"Ceded","Funds","Letters","Other"]
[null,null,"Premiums","Losses","Losses","Losses","Unearned",null,"Balances","Held by","of","Amounts"]
{"$rows_left_out":22}
{"sheet":"SCH. P - Part 1","index":11,"n_rows":65,"n_cols":7,"rows_kept":65,"cut":false,"hidden":false,"merged":[[0,0,0,6],[1,0,1,6],[2,0,2,6],[3,0,3,6]]}
[{"$f":"'COVER AND TABLE'!A6","v":"Company Name"}]
["Schedule P - Part 1"]
["Unpaid Loss and Loss Adjustment Reserves"]
[{"$f":"'COVER AND TABLE'!A35","v":"2023-12-31"}]
[]
[]
[]
[null,null,"(1)","(2)","(3)","(4)","(5)"]
{"$rows_left_out":58}
{"sheet":"SCH. P - Part 2","index":12,"n_rows":78,"n_cols":10,"rows_kept":78,"cut":false,"hidden":false,"merged":[[51,0,51,9],[52,0,52,9],[53,0,53,9],[54,0,54,9],[60,2,60,5],[3,0,3,9],[0,0,0,9],[1,0,1,9],[2,0,2,9],[27,2,27,5],[5,2,5,5]]}
[{"$f":"'COVER AND TABLE'!A6","v":"Company Name"}]
["Schedule P - Part 2"]
["Loss and Loss Adjustment Expenses Incurred"]
[{"$f":"'COVER AND TABLE'!A35","v":"2023-12-31"}]
[]
[null,null,"Losses Paid Less Salvage",null,null,null,"Net Losses","Net Losses","Net Losses"]
[null,null,"Direct","Reinsurance","Reinsurance","Net Paid","Unpaid","Unpaid","Incurred","Pure"]
[null,null,"Business","Assumed","Removed","(1+2-3)","Current Year","Prior Year","(4+5-6)","Loss Ratio"]
{"$rows_left_out":71}
{"sheet":"COMM AUTO LIAB","index":13,"n_rows":59,"n_cols":12,"rows_kept":59,"cut":false,"hidden":false,"merged":[[5,2,5,8],[50,1,51,1],[50,2,50,8],[1,0,1,11],[0,0,0,11],[2,0,2,11],[38,1,39,1],[27,1,28,1],[5,1,6,1],[16,1,17,1],[38,2,38,11],[27,2,27,8],[16,2,16,8]]}
[{"$f":"'COVER AND TABLE'!A6","v":"Company Name"}]
["Schedule P - Commercial Auto Liability Net Losses & LAE"]
[{"$f":"'COVER AND TABLE'!A35","v":"2023-12-31"}]
[]
[]
[null,"Years In Which Losses Were Incurred","CUMULATIVE NET PAID LOSSES AND LAE REPORTED AT YEAR-END"]
[null,null,"& Prior",{"$f":"+E7-1","v":2018},{"$f":"+F7-1","v":2019},{"$f":"+G7-1","v":2020},{"$f":"+H7-1","v":2021},{"$f":"+I7-1","v":2022},{"$f":"YEAR(A3)","v":2023}]
[null,"& Prior"]
{"$rows_left_out":52}
{"sheet":"COMM AUTO PD","index":14,"n_rows":59,"n_cols":12,"rows_kept":59,"cut":false,"hidden":false,"merged":[[16,1,17,1],[16,2,16,8],[0,0,0,11],[1,0,1,11],[2,0,2,11],[5,1,6,1],[5,2,5,8],[27,1,28,1],[27,2,27,8],[38,1,39,1],[38,2,38,11],[50,1,51,1],[50,2,50,8]]}
[{"$f":"'COVER AND TABLE'!A6","v":"Company Name"}]
["Schedule P - Commercial Auto Physical Damage Net Losses & LAE"]
[{"$f":"'COVER AND TABLE'!A35","v":"2023-12-31"}]
[]
[]
[null,"Years In Which Losses Were Incurred","CUMULATIVE NET PAID LOSSES AND LAE REPORTED AT YEAR-END"]
[null,null,"& Prior",{"$f":"+E7-1","v":2018},{"$f":"+F7-1","v":2019},{"$f":"+G7-1","v":2020},{"$f":"+H7-1","v":2021},{"$f":"+I7-1","v":2022},{"$f":"YEAR(A3)","v":2023}]
[null,"& Prior"]
{"$rows_left_out":52}
{"sheet":"COMM PROP","index":15,"n_rows":59,"n_cols":12,"rows_kept":59,"cut":false,"hidden":false,"merged":[[16,1,17,1],[16,2,16,8],[0,0,0,11],[1,0,1,11],[2,0,2,11],[5,1,6,1],[5,2,5,8],[27,1,28,1],[27,2,27,8],[38,1,39,1],[38,2,38,11],[50,1,51,1],[50,2,50,8]]}
[{"$f":"'COVER AND TABLE'!A6","v":"Company Name"}]
["Schedule P - Commercial Property Net Losses & LAE"]
[{"$f":"'COVER AND TABLE'!A35","v":"2023-12-31"}]
[]
[]
[null,"Years In Which Losses Were Incurred","CUMULATIVE NET PAID LOSSES AND LAE REPORTED AT YEAR-END"]
[null,null,"& Prior",{"$f":"+E7-1","v":2018},{"$f":"+F7-1","v":2019},{"$f":"+G7-1","v":2020},{"$f":"+H7-1","v":2021},{"$f":"+I7-1","v":2022},{"$f":"YEAR(A3)","v":2023}]
[null,"& Prior"]
{"$rows_left_out":52}
{"sheet":"CONTRACTUAL LIAB","index":16,"n_rows":59,"n_cols":12,"rows_kept":59,"cut":false,"hidden":false,"merged":[[0,0,0,11],[2,0,2,11],[27,1,28,1],[27,2,27,8],[16,1,17,1],[5,1,6,1],[5,2,5,8],[16,2,16,8],[50,1,51,1],[50,2,50,8],[38,1,39,1],[38,2,38,11],[1,0,1,11]]}
[{"$f":"'COVER AND TABLE'!A6","v":"Company Name"}]
["Schedule P - Contractual Liability Net Losses & LAE"]
[{"$f":"'COVER AND TABLE'!A35","v":"2023-12-31"}]
[]
[]
[null,"Years In Which Losses Were Incurred","CUMULATIVE NET PAID LOSSES AND LAE REPORTED AT YEAR-END"]
[null,null,"& Prior",{"$f":"+E7-1","v":2018},{"$f":"+F7-1","v":2019},{"$f":"+G7-1","v":2020},{"$f":"+H7-1","v":2021},{"$f":"+I7-1","v":2022},{"$f":"YEAR(A3)","v":2023}]
[null,"& Prior"]
{"$rows_left_out":52}
{"sheet":"EMPLOYEE BENEFITS","index":17,"n_rows":59,"n_cols":12,"rows_kept":59,"cut":false,"hidden":false,"merged":[[27,1,28,1],[27,2,27,8],[38,1,39,1],[38,2,38,11],[50,1,51,1],[50,2,50,8],[16,1,17,1],[16,2,16,8],[0,0,0,11],[1,0,1,11],[2,0,2,11],[5,1,6,1],[5,2,5,8]]}
[{"$f":"'COVER AND TABLE'!A6","v":"Company Name"}]
["Schedule P - Employee Benefits A&H Net Losses & LAE"]
[{"$f":"'COVER AND TABLE'!A35","v":"2023-12-31"}]
[]
[]
[null,"Years In Which Losses Were Incurred","CUMULATIVE NET PAID LOSSES AND LAE REPORTED AT YEAR-END"]
[null,null,"& Prior",{"$f":"+E7-1","v":2018},{"$f":"+F7-1","v":2019},{"$f":"+G7-1","v":2020},{"$f":"+H7-1","v":2021},{"$f":"+I7-1","v":2022},{"$f":"YEAR(A3)","v":2023}]
[null,"& Prior"]
{"$rows_left_out":52}
{"sheet":"GEN LIAB","index":18,"n_rows":59,"n_cols":12,"rows_kept":59,"cut":false,"hidden":false,"merged":[[0,0,0,11],[2,0,2,11],[27,1,28,1],[27,2,27,8],[16,1,17,1],[5,1,6,1],[16,2,16,8],[5,2,5,8],[50,1,51,1],[50,2,50,8],[38,1,39,1],[38,2,38,11],[1,0,1,11]]}
[{"$f":"'COVER AND TABLE'!A6","v":"Company Name"}]
["Schedule P - General Liability Net Losses & LAE"]
[{"$f":"'COVER AND TABLE'!A35","v":"2023-12-31"}]
[]
[]
[null,"Years In Which Losses Were Incurred","CUMULATIVE NET PAID LOSSES AND LAE REPORTED AT YEAR-END"]
[null,null,"& Prior",{"$f":"+E7-1","v":2018},{"$f":"+F7-1","v":2019},{"$f":"+G7-1","v":2020},{"$f":"+H7-1","v":2021},{"$f":"+I7-1","v":2022},{"$f":"YEAR(A3)","v":2023}]
[null,"& Prior"]
{"$rows_left_out":52}
{"sheet":"MULTI-PERIL CROP","index":19,"n_rows":59,"n_cols":12,"rows_kept":59,"cut":false,"hidden":false,"merged":[[16,1,17,1],[16,2,16,8],[0,0,0,11],[1,0,1,11],[2,0,2,11],[5,1,6,1],[5,2,5,8],[27,1,28,1],[27,2,27,8],[38,1,39,1],[38,2,38,11],[50,1,51,1],[50,2,50,8]]}
[{"$f":"'COVER AND TABLE'!A6","v":"Company Name"}]
["Schedule P - Multi-Peril Crop Net Losses & LAE"]
[{"$f":"'COVER AND TABLE'!A35","v":"2023-12-31"}]
[]
[]
[null,"Years In Which Losses Were Incurred","CUMULATIVE NET PAID LOSSES AND LAE REPORTED AT YEAR-END"]
[null,null,"& Prior",{"$f":"+E7-1","v":2018},{"$f":"+F7-1","v":2019},{"$f":"+G7-1","v":2020},{"$f":"+H7-1","v":2021},{"$f":"+I7-1","v":2022},{"$f":"YEAR(A3)","v":2023}]
[null,"& Prior"]
{"$rows_left_out":52}
{"sheet":"OTHER CAS","index":20,"n_rows":59,"n_cols":12,"rows_kept":59,"cut":false,"hidden":false,"merged":[[16,1,17,1],[16,2,16,8],[0,0,0,11],[1,0,1,11],[2,0,2,11],[5,1,6,1],[5,2,5,8],[27,1,28,1],[27,2,27,8],[38,1,39,1],[38,2,38,11],[50,1,51,1],[50,2,50,8]]}
[{"$f":"'COVER AND TABLE'!A6","v":"Company Name"}]
["Schedule P - Other Casualty Net Losses & LAE"]
[{"$f":"'COVER AND TABLE'!A35","v":"2023-12-31"}]
[]
[]
[null,"Years In Which Losses Were Incurred","CUMULATIVE NET PAID LOSSES AND LAE REPORTED AT YEAR-END"]
[null,null,"& Prior",{"$f":"+E7-1","v":2018},{"$f":"+F7-1","v":2019},{"$f":"+G7-1","v":2020},{"$f":"+H7-1","v":2021},{"$f":"+I7-1","v":2022},{"$f":"YEAR(A3)","v":2023}]
[null,"& Prior"]
{"$rows_left_out":52}
{"sheet":"PRODUCTS LIAB","index":21,"n_rows":59,"n_cols":12,"rows_kept":59,"cut":false,"hidden":false,"merged":[[16,1,17,1],[16,2,16,8],[0,0,0,11],[1,0,1,11],[2,0,2,11],[5,1,6,1],[5,2,5,8],[27,1,28,1],[27,2,27,8],[38,1,39,1],[38,2,38,11],[50,1,51,1],[50,2,50,8]]}
[{"$f":"'COVER AND TABLE'!A6","v":"Company Name"}]
["Schedule P - Product Liability Net Losses & LAE"]
[{"$f":"'COVER AND TABLE'!A35","v":"2023-12-31"}]
[]
[]
[null,"Years In Which Losses Were Incurred","CUMULATIVE NET PAID LOSSES AND LAE REPORTED AT YEAR-END"]
[null,null,"& Prior",{"$f":"+E7-1","v":2018},{"$f":"+F7-1","v":2019},{"$f":"+G7-1","v":2020},{"$f":"+H7-1","v":2021},{"$f":"+I7-1","v":2022},{"$f":"YEAR(A3)","v":2023}]
[null,"& Prior"]
{"$rows_left_out":52}
{"sheet":"PROF LIAB","index":22,"n_rows":59,"n_cols":12,"rows_kept":59,"cut":false,"hidden":false,"merged":[[0,0,0,11],[2,0,2,11],[27,1,28,1],[27,2,27,8],[16,1,17,1],[5,1,6,1],[5,2,5,8],[16,2,16,8],[50,1,51,1],[50,2,50,8],[38,1,39,1],[38,2,38,11],[1,0,1,11]]}
[{"$f":"'COVER AND TABLE'!A6","v":"Company Name"}]
["Schedule P - Professional Liability Net Losses & LAE"]
[{"$f":"'COVER AND TABLE'!A35","v":"2023-12-31"}]
[]
[]
[null,"Years In Which Losses Were Incurred","CUMULATIVE NET PAID LOSSES AND LAE REPORTED AT YEAR-END"]
[null,null,"& Prior",{"$f":"+E7-1","v":2018},{"$f":"+F7-1","v":2019},{"$f":"+G7-1","v":2020},{"$f":"+H7-1","v":2021},{"$f":"+I7-1","v":2022},{"$f":"YEAR(A3)","v":2023}]
[null,"& Prior"]
{"$rows_left_out":52}
{"sheet":"PROPERTY DAM LIAB","index":23,"n_rows":59,"n_cols":12,"rows_kept":59,"cut":false,"hidden":false,"merged":[[27,1,28,1],[27,2,27,8],[38,1,39,1],[38,2,38,11],[50,1,51,1],[50,2,50,8],[16,1,17,1],[16,2,16,8],[0,0,0,11],[1,0,1,11],[2,0,2,11],[5,1,6,1],[5,2,5,8]]}
[{"$f":"'COVER AND TABLE'!A6","v":"Company Name"}]
["Schedule P - Property Damage Liability Net Losses & LAE"]
[{"$f":"'COVER AND TABLE'!A35","v":"2023-12-31"}]
[]
[]
[null,"Years In Which Losses Were Incurred","CUMULATIVE NET PAID LOSSES AND LAE REPORTED AT YEAR-END"]
[null,null,"& Prior",{"$f":"+E7-1","v":2018},{"$f":"+F7-1","v":2019},{"$f":"+G7-1","v":2020},{"$f":"+H7-1","v":2021},{"$f":"+I7-1","v":2022},{"$f":"YEAR(A3)","v":2023}]
[null,"& Prior"]
{"$rows_left_out":52}
{"sheet":"REIMBURSEMENT POLICY","index":24,"n_rows":59,"n_cols":12,"rows_kept":59,"cut":false,"hidden":false,"merged":[[0,0,0,11],[2,0,2,11],[27,1,28,1],[27,2,27,8],[16,1,17,1],[5,1,6,1],[5,2,5,8],[16,2,16,8],[50,1,51,1],[50,2,50,8],[38,1,39,1],[38,2,38,11],[1,0,1,11]]}
[{"$f":"'COVER AND TABLE'!A6","v":"Company Name"}]
["Schedule P - Reimbursement Policy Net Losses & LAE"]
[{"$f":"'COVER AND TABLE'!A35","v":"2023-12-31"}]
[]
[]
[null,"Years In Which Losses Were Incurred","CUMULATIVE NET PAID LOSSES AND LAE REPORTED AT YEAR-END"]
[null,null,"& Prior",{"$f":"+E7-1","v":2018},{"$f":"+F7-1","v":2019},{"$f":"+G7-1","v":2020},{"$f":"+H7-1","v":2021},{"$f":"+I7-1","v":2022},{"$f":"YEAR(A3)","v":2023}]
[null,"& Prior"]
{"$rows_left_out":52}
{"sheet":"ALL OTHER","index":25,"n_rows":59,"n_cols":12,"rows_kept":59,"cut":false,"hidden":false,"merged":[[0,0,0,11],[2,0,2,11],[27,1,28,1],[27,2,27,8],[16,1,17,1],[5,1,6,1],[5,2,5,8],[16,2,16,8],[50,1,51,1],[50,2,50,8],[38,1,39,1],[38,2,38,11],[1,0,1,11]]}
[{"$f":"'COVER AND TABLE'!A6","v":"Company Name"}]
["Schedule P - All Other Lines Net Losses & LAE"]
[{"$f":"'COVER AND TABLE'!A35","v":"2023-12-31"}]
[]
[]
[null,"Years In Which Losses Were Incurred","CUMULATIVE NET PAID LOSSES AND LAE REPORTED AT YEAR-END"]
[null,null,"& Prior",{"$f":"+E7-1","v":2018},{"$f":"+F7-1","v":2019},{"$f":"+G7-1","v":2020},{"$f":"+H7-1","v":2021},{"$f":"+I7-1","v":2022},{"$f":"YEAR(A3)","v":2023}]
[null,"& Prior"]
{"$rows_left_out":52}
{"sheet":"SUMMARY DEVELOP","index":26,"n_rows":17,"n_cols":12,"rows_kept":17,"cut":false,"hidden":false,"merged":[[7,1,8,1],[7,2,7,11],[0,0,0,11],[2,0,2,11],[1,0,1,11]]}
[{"$f":"'COVER AND TABLE'!A6","v":"Company Name"}]
["Schedule P - Summary Loss Development - All Lines of Business"]
[{"$f":"'COVER AND TABLE'!A35","v":"2023-12-31"}]
[]
[]
[]
[]
[null,"Years In Which Losses Were Incurred","CUMULATIVE NET INCURRED LOSSES AND LAE REPORTED AT YEAR-END"]
{"$rows_left_out":10}
{"sheet":"QUESTIONNAIRE","index":27,"n_rows":218,"n_cols":14,"rows_kept":218,"cut":false,"hidden":false,"merged":[[172,4,172,5],[172,6,172,7],[167,4,167,5],[168,4,168,5],[168,6,168,7],[169,4,169,5],[169,6,169,7],[170,4,170,5],[170,6,170,7],[171,4,171,5],[171,6,171,7],[197,3,197,9],[199,3,199,9],[205,3,205,9],[207,4,207,10],[211,3,211,9],[213,3,213,9],[215,4,215,9],[37,3,37,9],[59,3,59,9],[66,3,66,9],[110,5,110,6],[46,3,46,9],[49,3,49,9],[90,4,90,5],[88,8,88,9],[90,2,90,3],[89,8,89,9],[62,3,62,9],[89,4,89,5],[90,8,90,9],[91,2,91,3],[87,4,87,5],[91,4,91,5],[88,2,88,3],[89,2,89,3],[89,6,89,7],[87,8,87,9],[109,5,109,6],[109,8,109,9],[88,6,88,7],[103,8,103,9],[40,3,40,9],[41,3,41,9],[47,3,47,9],[48,3,48,9],[45,3,45,9],[87,2,87,3],[86,4,86,5],[86,8,86,9],[108,5,108,6],[107,5,107,6],[55,3,55,9],[86,6,86,7],[87,6,87,7],[38,3,38,9],[71,3,71,9],[72,3,72,9],[39,3,39,9],[57,3,57,9],[67,3,67,9],[53,3,53,9],[54,3,54,9],[189,4,189,5],[177,6,177,7],[178,6,178,7],[179,6,179,7],[180,6,180,7],[183,6,183,7],[189,6,189,7],[177,4,177,5],[178,4,178,5],[180,4,180,5],[179,4,179,5],[183,4,183,5],[184,4,184,5],[184,6,184,7],[185,4,185,5],[185,6,185,7],[188,4,188,5],[188,6,188,7],[181,4,181,5],[181,6,181,7],[182,4,182,5],[182,6,182,7],[186,4,186,5],[186,6,186,7],[33,3,33,9],[90,6,90,7],[91,6,91,7],[97,8,97,9],[176,4,176,5],[176,6,176,7],[153,8,153,9],[134,8,134,9],[112,8,112,9],[122,1,125,11],[145,1,148,11],[117,10,117,11],[129,1,132,11],[167,6,167,7],[187,4,187,5],[187,6,187,7],[25,3,25,9],[31,3,31,9],[22,3,22,9],[110,8,110,9],[91,8,91,9],[98,8,98,9],[107,8,107,9],[108,8,108,9],[58,3,58,9],[63,3,63,9],[64,3,64,9],[74,3,74,9],[75,3,75,9],[86,2,86,3],[78,8,78,9],[81,8,81,9],[32,3,32,9],[29,3,29,9],[30,3,30,9],[73,3,73,9],[88,4,88,5],[61,3,61,9],[65,3,65,9],[56,3,56,9],[9,9,9,11],[0,0,0,11],[2,0,2,11],[3,0,3,11],[1,0,1,11],[7,2,7,9],[13,3,13,9],[14,3,14,9],[24,3,24,9],[21,3,21,9],[15,3,15,9],[16,3,16,9],[17,3,17,9],[23,3,23,9]]}
[{"$f":"'COVER AND TABLE'!A6","v":"Company Name"}]
["Questionnaire"]
[{"$f":"'COVER AND TABLE'!A35","v":"2023-12-31"}]
[]
[]
["1.","Name of the individual, company, corporation or association who owns or controls the captive insurance company."]
[]
[]
{"$rows_left_out":211}
{"sheet":"CROSSCHECK","index":28,"n_rows":58,"n_cols":13,"rows_kept":58,"cut":false,"hidden":false,"merged":[[0,0,0,12],[1,0,1,12],[2,0,2,12],[4,8,4,9],[4,11,4,12]]}
[{"$f":"'COVER AND TABLE'!A6","v":"Company Name"}]
["Crosscheck Guide"]
[{"$f":"'COVER AND TABLE'!A35","v":"2023-12-31"}]
[]
[null,null,null,null,null,null,null,null,{"$f":"'COVER AND TABLE'!A35","v":"2023-12-31"},null,null,{"$f":"DATE(YEAR(I5)-1,MONTH(I5),DAY(I5))","v":"2022-12-31"}]
[null,null,null,null,null,null,null,null,"Test","Result",null,"Test","Result"]
[]
["Total Assets equal to Total Liabilities, Capital & Surplus",null,null,null,null,null,null,null,{"$f":"IF(ABS(ASSETS!F31-'LIAB & CAPITAL'!F38)<2,\"PASS\",\"FAIL\")","v":"PASS"},{"$f":"ASSETS!F31-'LIAB & CAPITAL'!F38","v":0},null,{"$f":"IF(ABS(ASSETS!H31-'LIAB & CAPITAL'!H38)<2,\"PASS\", \"FAIL\")","v":"PASS"},{"$f":"IF(ASSETS!H31='LIAB & CAPITAL'!H38,0,ASSETS!H31-'LIAB & CAPITAL'!H38)","v":0}]
{"$rows_left_out":50}